{"text_format":"1","workbook":"xlsx","n_sheets":6,"sheets":["Mode-emploi","Calendrier","Demande de VS","Liste des DT-EIC-SITES","Programme de travail prev","Paramètres"],"not_rendered":{"charts":0,"images":3,"macros":1,"external_links":0,"defined_names":13,"comments":1,"pivot_tables":0},"unopened":[],"bounds":{"document_bytes":16777216,"sheet_cells":100000,"rows_first":2000,"rows_last":500,"rows_between":2000,"halvings":0,"cell_chars":16384,"cell_head_chars":4096},"cells_cut":0,"cells_raw":0,"read":"whole","date_system":"1900"}

{"sheet":"Mode-emploi","index":0,"n_rows":64,"n_cols":3,"rows_kept":64,"cut":false,"hidden":false,"merged":[[64,1,64,7],[31,2,32,7],[35,1,35,7],[36,1,36,7],[37,1,37,7],[38,1,38,7],[39,1,39,7],[43,1,45,7],[51,1,51,7],[52,1,52,7],[55,1,55,7],[63,1,63,7],[25,2,25,7],[10,1,10,7],[13,1,14,7],[17,1,17,7],[23,2,23,7],[24,2,24,7]]}
[]
["FORMULAIRE DE DEMANDE DE VOIES DE SERVICE"]
["MODE D'EMPLOI"]
[]
[null,"Pour toutes questions sur la complétude du fichier, contacter la PSEF : services.psef@sncf.fr"]
[]
[null,"Horaire de service : "]
[null,"Service Annuel : \u009f SA 2025 (du 15/12/2024 au 13/12/2025)"]
[]
[null,"Direction Territoriale SNCF Réseau : "]
[null,"Le candidat doit impérativement soumettre une demande (= un fichier) par périmètre de  Direction Territoriale SNCF Réseau. C'est un préalable obligatoire pour pouvoir sélectionner ensuite des sites dépendant du périmètre de celle-ci.\nExemple : si besoin de capacité sur les sites de Sibelin et Woippy, \nà Alors renseigner un formulaire pour la DT Auvergne Rhone Alpes pour Sibelin ET un formulaire pour la DT Grand-Est pour Woippy"]
[]
[null,"Site : "]
[null,"Site proposant des voies de service commercialisables. A choisir dans la liste déroulante des sites dépendant de la DT SNCF Réseau (à sélectionner obligatoirement au préalable)"]
[]
[]
[null,"Longueur minimale demandée en ml"]
[null,"Pour un site donné, par exemple, au choix, quatre lignes de fichier à 500 ml chacune, ou une seule ligne de fichier à 2000 ml"]
[]
[null,"Régime d'utilisation : "]
[null,"Renseigner le régime (ou fréquence) de circulation prévu : "]
[null,"Pour une circulation quotidienne, indiquer OUI dans quotidien ?. Les champs seront complétés automatiquement. "]
[null,"Pour tout autre régime d'utilisation, sélectionner les jours souhaités."]
[null,"Par exemple :","\u009f LU ME : signifie que le train est prévu de circuler tous les lundis et mercredis pendant la période demandée"]
[null,null,"\u009f Quotidien ? : du lundi au dimanche yc jours fériés, pendant la période demandée"]
[null,null,"\u009f Férié : jour de fêtes ( le 1er janvier, Pâques, le lundi de Pâques, le 1er mai, le 8 mai, l'Ascension, le lundi de Pentecôte, le 14 juillet, le 15 août, le 1er novembre, le 11 novembre et le 25 décembre)"]
[]
[null,"Période : "]
[null,"Renseigner une ligne pour chaque période de l'année concernée en choisissant une date de début et une date de fin"]
[null,"Par exemple :  \u009f SA2024 (pour tout le service annuel, en 2024 : du 10/12/2023 au 14/12/2024)"]
{"$rows_left_out":35}
{"sheet":"Calendrier","index":1,"n_rows":4,"n_cols":2,"rows_kept":4,"cut":false,"hidden":false,"merged":[]}
[]
["CALENDRIER  D'INSTRUCTION DES DEMANDES D'ALLOCATION DE CAPACITÉ"]
["VOIES DE SERVICE À USAGE COURANT"]
[null,"(cf. DRR chap. 7.3.5.6 b)"]

{"sheet":"Demande de VS","index":2,"n_rows":519,"n_cols":46,"rows_kept":519,"cut":false,"hidden":false,"merged":[[0,2,0,16],[2,2,2,12],[16,1,17,2],[16,3,16,14],[16,16,17,22],[8,2,8,12],[8,13,8,16],[10,2,10,12],[10,13,10,16],[12,2,12,12],[12,13,12,16],[2,13,2,16],[4,2,4,12],[4,13,4,16],[6,2,6,12],[6,13,6,16],[17,4,17,12],[17,13,17,14],[16,40,17,41],[16,44,17,45],[16,23,17,27],[16,28,17,31],[16,32,17,39],[16,42,18,42],[16,43,18,43]]}
[null,null,"EXPRESSION DE BESOIN EN VOIES DE SERVICE\nFiche à envoyer à la PSEF -  courriel : services.psef@sncf.fr "]
[]
[null,null,"Horaire de service * :",null,null,null,null,null,null,null,null,null,null,2025]
[]
[null,null,"Date de la demande * :",null,null,null,null,null,null,null,null,null,null,null,null,null,null,null,"Rappel : Calendrier d'envoi des demandes pour l'année A (cf. DRR chap. 7.3.5.6 b)"]
[]
[null,null,"Raison sociale du demandeur * : ",null,null,null,null,null,null,null,null,null,null,null,null,null,null,null,"\u009f Demandes initiales : jusqu'au 15 juin année A-1"]
[]
[null,null,"Identité du demandeur * :",null,null,null,null,null,null,null,null,null,null,null,null,null,null,null,"\u009f Demandes complémentaires : du 16 juin au 15 octobre année A-1"]
[]
[null,null,"Coordonnées du demandeur (courriel, tel.) * :",null,null,null,null,null,null,null,null,null,null,null,null,null,null,null,"\u009f Demandes tardives ou ad hoc : du 16 octobre année A-1 à fin de SA année A"]
[]
[null,null,"Direction Territoriale SNCF Réseau * :",null,null,null,null,null,null,null,null,null,null,"BFC"]
[null,"Les champs marqués d'un astérisque * sont à compléter obligatoirement par le Candidat, à défaut, la demande sera considérée comme incomplète et sera retournée au Candidat sans instruction. "]
[null,"Compléter une ligne par VS demandée ; si la demande concerne un linéaire sans nombre précis de voie, indiquer sur une seule ligne le linéaire global souhaité pour ce site."]
[null,"Consulter l'onglet \"Mode d'emploi\" au préalable"]
[null,"Localisation",null,"Capacité demandée",null,null,null,null,null,null,null,null,null,null,null,null,"Caractéristiques des Voie(s) demandée(s)",null,null,null,null,null,null,"Objectivation de la demande ",null,null,null,null,"Zone Réservée à SNCF Réseau - EIC et DT Réseau ",null,null,null,"Régime d'utilisation",null,null,null,null,null,null,null,"Période",null,"Commentaires (ex: jours exclus, infos complémentaires...) ou motif si refus"," Modèle contractuel retenu","Nombre d'Unités d'Œuvre (UO)\ncalcul de la redevance "]
[null,null,null,null,"Régime d'utilisation *",null,null,null,null,null,null,null,null,"Période *"]
["Index","Site *","EIC \n (pas de saisie ici)","Longueur minimale demandée en ml *","Quotidien?","LU","MA","ME","JE","VE","SA","DI","Férié","Du","au","Nombre de train accédant / jour *","Numéro de voie souhaité","Aptitude TE *","Electrification *","Charge *","MD *","Type \nd'utilisation *","Contraintes\nAutres","Type d'Activité  *","Nature du trafic  *","N° sillon \nou \nN° commande","Prospection","Commentaires  \nO/D","Type de réponse","id VS","N° de Voie\nallouée","Longueur utile totale allouée en ml","LU","MA","ME","JE","VE","SA","DI","Férié","Du","au",null,null,"Nb de jours d'utilisation","Nb de trains accédant"]
[{"$f":"_xlfn.SEQUENCE(500)","v":1},null,{"$f":"IFERROR(VLOOKUP(B20,Paramètres!$O$4:$P$2000,2,FALSE),\"\")","v":""},null,null,null,null,null,null,null,null,null,null,null,null,null,null,null,null,null,null,null,null,null,null,null,null,null,null,null,null,null,null,null,null,null,null,null,null,null,null,null,""]
[2,null,{"$f":"IFERROR(VLOOKUP(B21,Paramètres!$O$4:$P$2000,2,FALSE),\"\")","v":""},null,null,null,null,null,null,null,null,null,null,null,null,null,null,null,null,null,null,null,null,null,null,null,null,null,null,null,null,null,null,null,null,null,null,null,null,null,null,null,""]
[3,null,{"$f":"IFERROR(VLOOKUP(B22,Paramètres!$O$4:$P$2000,2,FALSE),\"\")","v":""},null,null,null,null,null,null,null,null,null,null,null,null,null,null,null,null,null,null,null,null,null,null,null,null,null,null,null,null,null,null,null,null,null,null,null,null,null,null,null,""]
[4,null,{"$f":"IFERROR(VLOOKUP(B23,Paramètres!$O$4:$P$2000,2,FALSE),\"\")","v":""},null,null,null,null,null,null,null,null,null,null,null,null,null,null,null,null,null,null,null,null,null,null,null,null,null,null,null,null,null,null,null,null,null,null,null,null,null,null,null,""]
[5,null,{"$f":"IFERROR(VLOOKUP(B24,Paramètres!$O$4:$P$2000,2,FALSE),\"\")","v":""},null,null,null,null,null,null,null,null,null,null,null,null,null,null,null,null,null,null,null,null,null,null,null,null,null,null,null,null,null,null,null,null,null,null,null,null,null,null,null,""]
[6,null,{"$f":"IFERROR(VLOOKUP(B25,Paramètres!$O$4:$P$2000,2,FALSE),\"\")","v":""},null,null,null,null,null,null,null,null,null,null,null,null,null,null,null,null,null,null,null,null,null,null,null,null,null,null,null,null,null,null,null,null,null,null,null,null,null,null,null,""]
[7,null,{"$f":"IFERROR(VLOOKUP(B26,Paramètres!$O$4:$P$2000,2,FALSE),\"\")","v":""},null,null,null,null,null,null,null,null,null,null,null,null,null,null,null,null,null,null,null,null,null,null,null,null,null,null,null,null,null,null,null,null,null,null,null,null,null,null,null,""]
[8,null,{"$f":"IFERROR(VLOOKUP(B27,Paramètres!$O$4:$P$2000,2,FALSE),\"\")","v":""},null,null,null,null,null,null,null,null,null,null,null,null,null,null,null,null,null,null,null,null,null,null,null,null,null,null,null,null,null,null,null,null,null,null,null,null,null,null,null,""]
[9,null,{"$f":"IFERROR(VLOOKUP(B28,Paramètres!$O$4:$P$2000,2,FALSE),\"\")","v":""}]
[10,null,{"$f":"IFERROR(VLOOKUP(B29,Paramètres!$O$4:$P$2000,2,FALSE),\"\")","v":""}]
[11,null,{"$f":"IFERROR(VLOOKUP(B30,Paramètres!$O$4:$P$2000,2,FALSE),\"\")","v":""}]
{"$rows_left_out":490}
{"sheet":"Liste des DT-EIC-SITES","index":3,"n_rows":808,"n_cols":4,"rows_kept":808,"cut":false,"hidden":false,"merged":[[1,1,2,3]]}
[]
[null,"Liste des voies commercialisables au 29/03/2024"]
[]
[]
[null,"Direction territoriale","Région SNCF (EIC)","Nom du site"]
[null,"AURA","EIC Alpes","Aix-les-Bains-Le Revard"]
[null,"AURA","EIC Alpes","Albertville"]
[null,"AURA","EIC Alpes","Ambérieu"]
[null,"AURA","EIC Alpes","Annecy"]
[null,"AURA","EIC Alpes","Annemasse"]
[null,"AURA","EIC Alpes","Bellegarde"]
[null,"AURA","EIC Alpes","Bourg-en-Bresse"]
[null,"AURA","EIC Alpes","Bourg-St-Maurice"]
[null,"AURA","EIC Alpes","Chambéry-Challes-les-Eaux"]
[null,"AURA","EIC Alpes","Clelles-Mens"]
[null,"AURA","EIC Alpes","Culoz"]
[null,"AURA","EIC Alpes","Épierre-St-Léger"]
[null,"AURA","EIC Alpes","Évian-les-Bains"]
[null,"AURA","EIC Alpes","Grenoble"]
[null,"AURA","EIC Alpes","Grenoble-Université-Gières"]
[null,"AURA","EIC Alpes","Grésy-sur-Isère"]
[null,"AURA","EIC Alpes","Jarrie-Vizille"]
[null,"AURA","EIC Alpes","La Roche-sur-Foron"]
[null,"AURA","EIC Alpes","Lus-la-Croix-Haute"]
[null,"AURA","EIC Alpes","Marignier"]
[null,"AURA","EIC Alpes","Modane"]
[null,"AURA","EIC Alpes","Montmélian"]
[null,"AURA","EIC Alpes","Notre-Dame-de-Briançon"]
[null,"AURA","EIC Alpes","Perrignier"]
[null,"AURA","EIC Alpes","Pontcharra-sur-Breda-Allevard"]
{"$rows_left_out":779}
{"sheet":"Programme de travail prev","index":4,"n_rows":102,"n_cols":98,"rows_kept":102,"cut":false,"hidden":false,"merged":[[72,1,73,1],[72,2,72,25],[86,1,87,1],[86,2,86,25],[102,1,109,49],[30,1,31,1],[30,2,30,25],[44,1,45,1],[44,2,44,25],[58,1,59,1],[58,2,58,25],[0,5,0,25],[0,30,0,34],[0,40,0,46],[2,1,3,1],[16,1,17,1],[16,2,16,25]]}
[null,null,null,null,null,"Programme de travail (exemple)\n(document à fournir dans le cadre des concertations)",null,null,null,null,null,null,null,null,null,null,null,null,null,null,null,null,null,null,null,null,"Demandeur :",null,null,null,null,null,null,null,null,"Site demandé :"]
[]
[null,"Voies","LUNDI"]
[null,null,0,null,null,null,1,null,null,null,2,null,null,null,3,null,null,null,4,null,null,null,5,null,null,null,6,null,null,null,7,null,null,null,8,null,null,null,9,null,null,null,10,null,null,null,11,null,null,null,12,null,null,null,13,null,null,null,14,null,null,null,15,null,null,null,16,null,null,null,17,null,null,null,18,null,null,null,19,null,null,null,20,null,null,null,21,null,null,null,22,null,null,null,23]
[null,1]
[null,2]
[null,3]
[null,4]
[null,5]
[null,6]
[null,7]
[null,8]
[null,9]
[null,10]
[null,null,0,15,30,45,0,15,30,45,0,15,30,45,0,15,30,45,0,15,30,45,0,15,30,45,0,15,30,45,0,15,30,45,0,15,30,45,0,15,30,45,0,15,30,45,0,15,30,45,0,15,30,45,0,15,30,45,0,15,30,45,0,15,30,45,0,15,30,45,0,15,30,45,0,15,30,45,0,15,30,45,0,15,30,45,0,15,30,45,0,15,30,45,0,15,30,45]
[]
[null,"Voies","MARDI"]
[null,null,0,null,null,null,1,null,null,null,2,null,null,null,3,null,null,null,4,null,null,null,5,null,null,null,6,null,null,null,7,null,null,null,8,null,null,null,9,null,null,null,10,null,null,null,11,null,null,null,12,null,null,null,13,null,null,null,14,null,null,null,15,null,null,null,16,null,null,null,17,null,null,null,18,null,null,null,19,null,null,null,20,null,null,null,21,null,null,null,22,null,null,null,23]
[null,1]
[null,2]
[null,3]
[null,4]
[null,5]
[null,6]
[null,7]
[null,8]
[null,9]
[null,10]
[null,null,0,15,30,45,0,15,30,45,0,15,30,45,0,15,30,45,0,15,30,45,0,15,30,45,0,15,30,45,0,15,30,45,0,15,30,45,0,15,30,45,0,15,30,45,0,15,30,45,0,15,30,45,0,15,30,45,0,15,30,45,0,15,30,45,0,15,30,45,0,15,30,45,0,15,30,45,0,15,30,45,0,15,30,45,0,15,30,45,0,15,30,45,0,15,30,45]
[]
{"$rows_left_out":73}
{"sheet":"Paramètres","index":5,"n_rows":805,"n_cols":33,"rows_kept":805,"cut":false,"hidden":true,"merged":[[0,1,0,12],[0,14,0,15],[0,17,1,17],[0,19,1,19],[0,21,1,21],[0,25,1,25],[0,27,1,27],[0,29,1,29],[1,14,1,15],[0,31,0,32],[0,23,1,23]]}
[null,"Tableau nécessaire pour la liste des DT et des sites",null,null,null,null,null,null,null,null,null,null,null,null,"Tableau necessaire pour la formule EIC",null,null,"Liste déroulante Oui/Non pour les colonnes E+R+S+U+AA (quotidien+Aptitude TE+Electrification+MD+Prospection)",null,"Liste déroulante C4/D4 pour la colonne T (Charge)",null,"Liste déroulante pour la colonne V (Type d'utilisation)",null,"Liste déroulante pour la colonne X (Type d'activité)",null,"Liste déroulante pour la colonne Y (Nature du trafic)",null,"Liste déroulante pour la colonne AC (Type de réponse)",null,"Liste déroulante pour la colonne AR (Modèle contractuel retenu)",null,"HDS 2025"]
[null,"DT →","AURA","BFC","BPL","CVL","GE","NO","HDF","IDF","NA","OCC","PACA",null,"Liste des voies commercialisables au 29/03/2024",null,null,null,null,null,null,null,null,null,null,null,null,null,null,null,null,"Du","Au"]
[null,"Liste des sites↓",{"$f":"_xlfn._xlws.SORT(_xlfn.CHOOSECOLS(_xlfn._xlws.FILTER('Liste des DT-EIC-SITES'!$B$6:$D$807,'Liste des DT-EIC-SITES'!$B$6:$B$807=C2),3),1,1)","v":"Aix-les-Bains-Le Revard"},{"$f":"_xlfn._xlws.SORT(_xlfn.CHOOSECOLS(_xlfn._xlws.FILTER('Liste des DT-EIC-SITES'!$B$6:$D$807,'Liste des DT-EIC-SITES'!$B$6:$B$807=D2),3),1,1)","v":"Aillevillers"},{"$f":"_xlfn._xlws.SORT(_xlfn.CHOOSECOLS(_xlfn._xlws.FILTER('Liste des DT-EIC-SITES'!$B$6:$D$807,'Liste des DT-EIC-SITES'!$B$6:$B$807=E2),3),1,1)","v":"Angers-St-Laud"},{"$f":"_xlfn._xlws.SORT(_xlfn.CHOOSECOLS(_xlfn._xlws.FILTER('Liste des DT-EIC-SITES'!$B$6:$D$807,'Liste des DT-EIC-SITES'!$B$6:$B$807=F2),3),1,1)","v":"Argenton-sur-Creuse"},{"$f":"_xlfn._xlws.SORT(_xlfn.CHOOSECOLS(_xlfn._xlws.FILTER('Liste des DT-EIC-SITES'!$B$6:$D$807,'Liste des DT-EIC-SITES'!$B$6:$B$807=G2),3),1,1)","v":"Apach"},{"$f":"_xlfn._xlws.SORT(_xlfn.CHOOSECOLS(_xlfn._xlws.FILTER('Liste des DT-EIC-SITES'!$B$6:$D$807,'Liste des DT-EIC-SITES'!$B$6:$B$807=H2),3),1,1)","v":"Alençon"},{"$f":"_xlfn._xlws.SORT(_xlfn.CHOOSECOLS(_xlfn._xlws.FILTER('Liste des DT-EIC-SITES'!$B$6:$D$807,'Liste des DT-EIC-SITES'!$B$6:$B$807=I2),3),1,1)","v":"Abbeville"},{"$f":"_xlfn._xlws.SORT(_xlfn.CHOOSECOLS(_xlfn._xlws.FILTER('Liste des DT-EIC-SITES'!$B$6:$D$807,'Liste des DT-EIC-SITES'!$B$6:$B$807=J2),3),1,1)","v":"Achères-Grand-Cormier"},{"$f":"_xlfn._xlws.SORT(_xlfn.CHOOSECOLS(_xlfn._xlws.FILTER('Liste des DT-EIC-SITES'!$B$6:$D$807,'Liste des DT-EIC-SITES'!$B$6:$B$807=K2),3),1,1)","v":"Agen"},{"$f":"_xlfn._xlws.SORT(_xlfn.CHOOSECOLS(_xlfn._xlws.FILTER('Liste des DT-EIC-SITES'!$B$6:$D$807,'Liste des DT-EIC-SITES'!$B$6:$B$807=L2),3),1,1)","v":"Aigues-Mortes"},{"$f":"_xlfn._xlws.SORT(_xlfn.CHOOSECOLS(_xlfn._xlws.FILTER('Liste des DT-EIC-SITES'!$B$6:$D$807,'Liste des DT-EIC-SITES'!$B$6:$B$807=M2),3),1,1)","v":"Aix-en-Provence"},null,"Nom du Site","Région SNCF (EIC)",null,"Oui",null,"C4",null,"Travail",null,"Voyageurs",null,"Fret auto",null,"Attribution Totale",null,"Contrat HDS",null,"2024-12-15","2025-12-13"]
[null,null,"Albertville","Andelot","Auray","Avord","Arcis-sur-Aube","Bréauté-Beuzeville","Achiet","Achères-Ville","Aiffres","Albi","Antibes",null,{"$f":"_xlfn._xlws.SORT(_xlfn.CHOOSECOLS('Liste des DT-EIC-SITES'!$B$6:$D$807,3),1,1)","v":"Abbeville"},{"$f":"_xlfn.XLOOKUP(O4,'Liste des DT-EIC-SITES'!D:D,'Liste des DT-EIC-SITES'!C:C)","v":"EIC Hauts de France"},null,"Non",null,"D4",null,"Stationnement",null,"Fret",null,"Fret céréales",null,"Attribution Partielle",null,"Déclaratif"]
[null,null,"Ambérieu","Autun","Brest","Beaugency","Bantzenheim","Caen","Ailly-sur-Noye","Argenteuil GC","Angoulême","Alès","Arles",null,"Achères-Grand-Cormier",{"$f":"_xlfn.XLOOKUP(O5,'Liste des DT-EIC-SITES'!D:D,'Liste des DT-EIC-SITES'!C:C)","v":"EIC Paris Est Ouest Francilien"},null,null,null,null,null,"Stationnement et travail",null,null,null,"Fret chimie",null,"Proposition Alternative",null,"Non concerné"]
[null,null,"Annecy","Auxonne","Champagné","Blois-Chambord","Bar-le-Duc","Cherbourg","Amiens","Aulnay-sous-Bois","Arcachon","Auch","Aspres-sur-Buëch",null,"Achères-Ville",{"$f":"_xlfn.XLOOKUP(O6,'Liste des DT-EIC-SITES'!D:D,'Liste des DT-EIC-SITES'!C:C)","v":"EIC Paris Est Ouest Francilien"},null,null,null,null,null,null,null,null,null,"Fret divers",null,"A l'étude"]
[null,null,"Annemasse","Belfort","Chantenay","Bourges","Blainville-Damelevières","Dieppe","Anor","Bécon-les-Bruyères","Artix","Aumont-Aubrac","Aubagne",null,"Achiet",{"$f":"_xlfn.XLOOKUP(O7,'Liste des DT-EIC-SITES'!D:D,'Liste des DT-EIC-SITES'!C:C)","v":"EIC Hauts de France"},null,null,null,null,null,null,null,null,null,"Fret granulat",null,"Demande Annulée"]
[null,null,"Arvant","Besançon-St-Fergeux","Châteaubriant","Bricy-Boulay","Châlons-en-Champagne","Elbeuf-St-Aubin","Armentières","Bois-Colombes","Ayron-Latillé","Ax-les-Thermes","Avignon-Centre",null,"Agen",{"$f":"_xlfn.XLOOKUP(O8,'Liste des DT-EIC-SITES'!D:D,'Liste des DT-EIC-SITES'!C:C)","v":"EIC Aquitaine Poitou Charentes"},null,null,null,null,null,null,null,null,null,"Fret métallurgie",null,"Refus"]
[null,null,"Aurillac","Besançon-Viotte","Châtelaudren-Plouagat","Brou","Champigneulles","Étrépagny","Arras","Bourron-Marlotte-Grez","Aytré","Bagnac","Avignon-Fontcouverte",null,"Aiffres",{"$f":"_xlfn.XLOOKUP(O9,'Liste des DT-EIC-SITES'!D:D,'Liste des DT-EIC-SITES'!C:C)","v":"EIC Aquitaine Poitou Charentes"},null,null,null,null,null,null,null,null,null,"Militaire"]
[null,null,"Badan","Brazey-en-Plaine","Cholet","Buzançais","Charleville-Mézières","Évreux-Embranchement","Athies-sous-Laon","Brétigny","Bassens","Banassac-La Canourgue","Bollène-la-Croisière",null,"Aigues-Mortes",{"$f":"_xlfn.XLOOKUP(O10,'Liste des DT-EIC-SITES'!D:D,'Liste des DT-EIC-SITES'!C:C)","v":"EIC Languedoc Roussillon"},null,null,null,null,null,null,null,null,null,"Voyageur autres"]
[null,null,"Bellegarde","Cercy-la-Tour","Connerré-Beillé","Chartres","Chaumont","Gaillon-Aubevoye","Attin-Garage","Cergy-le-Haut","Bassens-Appontements","Baziège","Breil-sur-Roya",null,"Aillevillers",{"$f":"_xlfn.XLOOKUP(O11,'Liste des DT-EIC-SITES'!D:D,'Liste des DT-EIC-SITES'!C:C)","v":"EIC Bourgogne Franche Comté"},null,null,null,null,null,null,null,null,null,"Voyageur conventionné"]
[null,null,"Belleville-sur-Saône","Chagny","Donges-Bonne Nouvelle","Châteaudun","Colmar","Gisors","Aulnoye-Aymeries","Cergy-St-Christophe","Bayonne","Beaucaire","Briançon",null,"Ailly-sur-Noye",{"$f":"_xlfn.XLOOKUP(O12,'Liste des DT-EIC-SITES'!D:D,'Liste des DT-EIC-SITES'!C:C)","v":"EIC Hauts de France"},null,null,null,null,null,null,null,null,null,"Voyageur GV"]
[null,null,"Boën","Chalon-sur-Saône","Gérard","Château-Renault","Conflans-Jarny","Gravenchon-Port-Jérome","Bailleul-sur-Thérain","Changis-St-Jean","Bergerac","Bédarieux","Cannes-Marchandises",null,"Aix-en-Provence",{"$f":"_xlfn.XLOOKUP(O13,'Liste des DT-EIC-SITES'!D:D,'Liste des DT-EIC-SITES'!C:C)","v":"EIC Provence Alpes Côte d'Azur"}]
[null,null,"Bonson","Clamecy","Guingamp","Châteauroux","Culmont-Chalindrey","Le Havre","Beauvais","Clamart","Bessines","Béziers","Carnoules",null,"Aix-les-Bains-Le Revard",{"$f":"_xlfn.XLOOKUP(O14,'Liste des DT-EIC-SITES'!D:D,'Liste des DT-EIC-SITES'!C:C)","v":"EIC Alpes"}]
[null,null,"Bourg-en-Bresse","Corbigny","La Brohinière","Dreux","Epernay","Lisieux","Béthune","Combs-la-Ville-Quincy","Blanquefort","Bourg-Madame","Cavaillon",null,"Albertville",{"$f":"_xlfn.XLOOKUP(O15,'Liste des DT-EIC-SITES'!D:D,'Liste des DT-EIC-SITES'!C:C)","v":"EIC Alpes"}]
[null,null,"Bourgoin-Jallieu","Cosne-sur-Loire","La Hutte-Coulombiers","Gien","Épinal","Maromme","Blanc-Misseron","Corbeil-Essonnes","Bordeaux-Bastide","Boussens","Château-Arnoux-St-Auban",null,"Albi",{"$f":"_xlfn.XLOOKUP(O16,'Liste des DT-EIC-SITES'!D:D,'Liste des DT-EIC-SITES'!C:C)","v":"EIC Midi Pyrénées"}]
[null,null,"Bourg-St-Maurice","Digoin","La Roche-sur-Yon","Issoudun","Forbach","Petit-Couronne","Boisleux","Dammartin-Juilly-St-Mard","Bordeaux-Hourcade","Bretenoux-Biars","Embrun",null,"Alençon",{"$f":"_xlfn.XLOOKUP(O17,'Liste des DT-EIC-SITES'!D:D,'Liste des DT-EIC-SITES'!C:C)","v":"EIC Normandie"}]
[null,null,"Brignais","Dijon-Porte-d'Ouche-Perrigny","Lamballe","La Ferté-St-Aubin","Givet","Petit-Quevilly","Boulogne-Ville","Dourdan","Bordeaux-St-Jean","Cahors","Faisceau NOVATRANS Avignon-Champfleury",null,"Alès",{"$f":"_xlfn.XLOOKUP(O18,'Liste des DT-EIC-SITES'!D:D,'Liste des DT-EIC-SITES'!C:C)","v":"EIC Languedoc Roussillon"}]
[null,null,"Brioude","Dijon-Porte-Neuve","Laval","La Guerche-sur-l'Aubois","Gudmont","Pont-de-l'Arche","Bresles","Émerainville-Pontault-Combault","Bressuire","Capdenac","Fos-Coussoul",null,"Ambérieu",{"$f":"_xlfn.XLOOKUP(O19,'Liste des DT-EIC-SITES'!D:D,'Liste des DT-EIC-SITES'!C:C)","v":"EIC Alpes"}]
[null,null,"Chambéry-Challes-les-Eaux","Dijon-Ville","Le Croisic","Les Aubrais-Orléans","Hagondange","Rouen-Orléans","Bully-Grenay","Épinay-Villetaneuse","Brive-la-Gaillarde","Carbonne","Gap",null,"Amiens",{"$f":"_xlfn.XLOOKUP(O20,'Liste des DT-EIC-SITES'!D:D,'Liste des DT-EIC-SITES'!C:C)","v":"EIC Hauts de France"}]
[null,null,"Chasse-sur-Rhône","Dole","Le Mans","Malesherbes","Haguenau","Rouen-Rive-Droite","Busigny","Épluches","Bruges","Carcassonne","Gardanne",null,"Andelot",{"$f":"_xlfn.XLOOKUP(O21,'Liste des DT-EIC-SITES'!D:D,'Liste des DT-EIC-SITES'!C:C)","v":"EIC Bourgogne Franche Comté"}]
[null,null,"Clelles-Mens","Étang","Les Sables-d'Olonne","Meung-sur-Loire","Hausbergen","Rouxmesnil","Caffiers","Ermont-Eaubonne","Chalandray","Carmaux","La Pauline-Hyères",null,"Angers-St-Laud",{"$f":"_xlfn.XLOOKUP(O22,'Liste des DT-EIC-SITES'!D:D,'Liste des DT-EIC-SITES'!C:C)","v":"EIC Bretagne Pays de la Loire"}]
[null,null,"Clermont-Ferrand","Faisceau dépôt","Lorient","Montargis","Héming","Serqueux","Calais-Fréthun","Étampes","Charmant","Cases-de-Pène","La Seyne-Six-Fours",null,"Angoulême",{"$f":"_xlfn.XLOOKUP(O23,'Liste des DT-EIC-SITES'!D:D,'Liste des DT-EIC-SITES'!C:C)","v":"EIC Aquitaine Poitou Charentes"}]
[null,null,"Clermont-Les-Gravanches-Triage","faisceau impair","Montauban-de-Bretagne","Neuillé-Pont-Pierre","Jarville-la-Malgrange","Serquigny","Calais-Ville","Garches-Marnes-la-Coquette","Chasseneuil (Vienne)","Castelnaudary","Les Arcs-Draguignan",null,"Annecy",{"$f":"_xlfn.XLOOKUP(O24,'Liste des DT-EIC-SITES'!D:D,'Liste des DT-EIC-SITES'!C:C)","v":"EIC Alpes"}]
[null,null,"Collonges-Fontaines","Faisceau Plateforme Multimodale","Montfort-le-Gesnois","Neuvy-Pailloux","Langres","Sotteville","Cambrai","Gargenville","Châteauneuf-sur-Charente","Castelnau-d'Estrétefonds","Manosque-Gréoux-les-Bains",null,"Annemasse",{"$f":"_xlfn.XLOOKUP(O25,'Liste des DT-EIC-SITES'!D:D,'Liste des DT-EIC-SITES'!C:C)","v":"EIC Alpes"}]
[null,null,"Commentry","Gevrey-Chambertin","Montoir-de-Bretagne","Nogent-le-Rotrou","Lérouville","St-Pierre-lès-Elbeuf","Château-Thierry","Gennevilliers","Châtellerault","Castelsarrasin","Marseille-Maritime-Arenc",null,"Anor",{"$f":"_xlfn.XLOOKUP(O26,'Liste des DT-EIC-SITES'!D:D,'Liste des DT-EIC-SITES'!C:C)","v":"EIC Hauts de France"}]
[null,null,"Condrieu","Is-sur-Tille","Montreuil-Bellay","Nogent-sur-Vernisson","Longwy","St-Valéry-en-Caux","Chaulnes","Goussainville","Civaux","Castres","Marseille-Maritime-Canet",null,"Antibes",{"$f":"_xlfn.XLOOKUP(O27,'Liste des DT-EIC-SITES'!D:D,'Liste des DT-EIC-SITES'!C:C)","v":"EIC Provence Alpes Côte d'Azur"}]
[null,null,"Crest","Joigny","Nantes","Pithiviers","Metz-Ville","Trouville-Deauville","Chauny","Gretz-Armainvilliers","Cognac","Caussade","Marseille-Prado",null,"Apach",{"$f":"_xlfn.XLOOKUP(O28,'Liste des DT-EIC-SITES'!D:D,'Liste des DT-EIC-SITES'!C:C)","v":"EIC Lorraine Champagne Ardenne"}]
[null,null,"Culoz","Jussey","Nantes-Blottereau","Port-Boulet","Mulhouse-Nord","Valognes","Clermont-les-Fermes","Ivry-sur-Seine","Condat-le-Lardin","Ceilhes-Roqueredonde","Marseille-St-Charles",null,"Arcachon",{"$f":"_xlfn.XLOOKUP(O29,'Liste des DT-EIC-SITES'!D:D,'Liste des DT-EIC-SITES'!C:C)","v":"EIC Aquitaine Poitou Charentes"}]
[null,null,"Cusset","La Charité-sur-Loire","Nantes-État","Port-de-Piles","Nançois-Tronville","Vernon-Giverny","Compiègne","Juvisy","Couhé-Vérac","Cerbère","Martigues",null,"Arcis-sur-Aube",{"$f":"_xlfn.XLOOKUP(O30,'Liste des DT-EIC-SITES'!D:D,'Liste des DT-EIC-SITES'!C:C)","v":"EIC Lorraine Champagne Ardenne"}]
{"$rows_left_out":775}